Jump to content
Калькуляторы

Sup720-3BXL clock failed

Включаю сабж, сразу после загрузки в консоль сыпятся сообщения:

 

00:09:28: %C6KENV-SP-4-CLOCKOK: clock 1 operational

00:12:58: %C6KENV-SP-4-CLOCKFAILED: clock 1 failed

00:13:28: %C6KENV-SP-4-CLOCKOK: clock 1 operational

00:15:28: %C6KENV-SP-4-CLOCKFAILED: clock 1 failed

00:15:58: %C6KENV-SP-4-CLOCKOK: clock 1 operational

00:16:28: %C6KENV-SP-4-CLOCKFAILED: clock 1 failed

00:16:58: %C6KENV-SP-4-CLOCKOK: clock 1 operational

00:17:58: %C6KENV-SP-4-CLOCKFAILED: clock 1 failed

00:18:28: %C6KENV-SP-4-CLOCKOK: clock 1 operational

00:21:58: %C6KENV-SP-4-CLOCKFAILED: clock 1 failed

 

Сайт циско говорит:

 

Error Message C6KENV-4-CLOCKFAILED: clock [dec] failed

 

Explanation This message indicates that the indicated clock failed. The system will continue to operate using the redundant clock. [dec] is the clock number 1 or 2.

 

Recommended Action Replace the failed clock.

непонятно только что за часы и как их менять оО

Share this post


Link to post
Share on other sites

clock модуль утановлен на самом шасси. там еще установлены VTT модули.

Share this post


Link to post
Share on other sites
clock модуль утановлен на самом шасси. там еще установлены VTT модули.

печально... значит шасси битое?

Share this post


Link to post
Share on other sites

вполне возможно, что модуль просто отошел из посадочных мест.

открутите крышку, достаньте все модули и установите обратно.

Share this post


Link to post
Share on other sites

Не помогло. Светодиод горит красным. Позвонил продавцу - поменяет или модуль или все шасси.

Share this post


Link to post
Share on other sites

Create an account or sign in to comment

You need to be a member in order to leave a comment

Create an account

Sign up for a new account in our community. It's easy!

Register a new account

Sign in

Already have an account? Sign in here.

Sign In Now
Sign in to follow this