Перейти к содержимому
Калькуляторы

moose

Пользователи
  • Публикации

    12
  • Зарегистрирован

  • Посещение

О moose

  • Звание
    Абитуриент
  1. Установка ABillS видео пособие

    Гляньте здесь можете и на форуме abills спросить, там всегда подсказывают
  2. accel pptpd

    Всем привет, помоготе разобраться в следующей проблемке Ubuntu 10.10 accel-ppp 1.37 При подключении по пппое использовал внутрений шейпер от accel-ppp но исходящая скорость резалась плохо тоесть при задании скорости 2/2Мб резалось 2/1.3Мб, изминения up-burst-factor=10 ничего не дало запустили свой шейпер через ip-up скорость режит хорошо, но скорость которую выдает пппое без шейпера и с ним - входящая та что надо =90Мбит, а исходящая от клиента =40Мбит, больше не подымаеться, без ПППоЕ скорость на сервер 90/90Мбит. gro и lro отключены как на внутренем так и на внешнем интерфейсах. пробовал перустановить на 1.40, изминений никаких Подскажите пожалуйста в чем может быть проблема Спасибо
  3. Релиз открытой АСР системы ABillS 0.53 и сертифицированной в РФ коммерческой версии 0.6 Основные изменения: 1 Добавлена поддержка FreeRadius DHCP. Раздача динамических IP исходя из параметров опции 82, гостевой аккаунт 2 Улучшена работа с Cisco ISG. Более быстрая работа с CoA интерфейсом 3 Ashield Обновлен к версии протокола 6.0. Все действия с аккаунтом пользователя теперь производятся через веб интерфейс билинга 4 Новый модуль складской учёт Storage 5 В модуль карт Maps добавлена поддержка Google Maps 6 Добавлена поддержка платёжной системы PayPal 7 Добавлена утилита snmp_control.pl. Управление скоростью на портах коммутаторов D-Link, Edge core, а также управление VLAN. 8 Добавлена возможность переключения скорости в зависимости от временных интервалом для mpd шейпера с радиус парами. 9 Улучшен интерфейс кабинета пользователя, доработан интерфейс администратора: быстродействие, эргономика 10 Добавлена плотность подключения в журнал адресов 11 Много изменений коснулось Voip (смотреть ченжлог) 12 Много изменений коснулось модуля Abon (смотреть ченжлог) 13 В список систем миграции добавлено MikBill, Nodeny, Stargezer, Trafpro 14 Информационные сообщения по работе billd заносятся в журнал ошибок 15 Добавлен механизм группирования и ротации записей журнал ошибок 16 Добавлен экспорт в XML журналов платежей и снятий 17 Добавлена поддержка DvCrypt для модуля Iptv 18 В журнале пользователей добавлен фильтр по кредиторам И еще более 40 документированных изменений (смотрите ченжлог)
  4. accel pptpd

    дополнение к предыдущей ошибке при сборке ассел-ппп /home/test/accel-ppp/accel-pppd/extra/shaper_tbf.c:13:29: error: netlink/netlink.h: Нет такого файла или каталога /home/test/accel-ppp/accel-pppd/extra/shaper_tbf.c:14:28: error: netlink/socket.h: Нет такого файла или каталога /home/test/accel-ppp/accel-pppd/extra/shaper_tbf.c:15:25: error: netlink/msg.h: Нет такого файла или каталога .......... make[2]: *** [accel-pppd/extra/CMakeFiles/shaper_tbf.dir/shaper_tbf.c.o] Ошибка 1 make[1]: *** [accel-pppd/extra/CMakeFiles/shaper_tbf.dir/all] Ошибка 2 make: *** [all] Ошибка 2 Вопрос где не может найти netlink/netlink.h , так как он есть find / -name netlink.h /usr/include/netlink/netlink.h /usr/include/linux/netlink.h /usr/include/linux/can/netlink.h /usr/src/linux-2.6.35.9/include/config/netfilter/netlink.h /usr/src/linux-2.6.35.9/include/config/nf/ct/netlink.h /usr/src/linux-2.6.35.9/include/config/scsi/netlink.h /usr/src/linux-2.6.35.9/include/linux/netlink.h /usr/src/linux-2.6.35.9/include/linux/can/netlink.h /usr/src/linux-2.6.35.9/include/net/netlink.h /usr/src/linux-2.6.35.9/usr/include/linux/netlink.h /usr/src/linux-2.6.35.9/usr/include/linux/can/netlink.h если сделать симлинк с /usr/include/netlink/netlink.h в usr/src/linux-2.6.35.9/include тогда устанавливается но предуприждения выдает [ 96%] Building C object accel-pppd/extra/CMakeFiles/shaper_tbf.dir/shaper_tbf.c.o /home/test/accel-ppp/accel-pppd/extra/shaper_tbf.c:146: предупреждение: декларация ‘struct nl_sock’ внутри списка параметров /home/test/accel-ppp/accel-pppd/extra/shaper_tbf.c:146: предупреждение: область дей ствия типа - только данная декларация или определение, что может не соответствовать в ашим намерениям /home/test/accel-ppp/accel-pppd/extra/shaper_tbf.c: В функции ‘install_tbf’: /home/test/accel-ppp/accel-pppd/extra/shaper_tbf.c:188: предупреждение: в передаче аргумента 1 ‘nl_send_auto_complete’: несовместимый тип указателя /usr/include/netlink/netlink.h:48: замечание: expected ‘struct nl_handle *’ but argum ent is of type ‘struct nl_sock *’ /home/test/accel-ppp/accel-pppd/extra/shaper_tbf.c:191: предупреждение: в передаче аргумента 1 ‘nl_wait_for_ack’: несовместимый тип указателя /usr/include/netlink/netlink.h:63: замечание: expected ‘struct nl_handle *’ but argum ent is of type ‘struct nl_sock *’ /home/test/accel-ppp/accel-pppd/extra/shaper_tbf.c: На верхнем уровне: /home/test/accel-ppp/accel-pppd/extra/shaper_tbf.c:213: предупреждение: декларация ‘struct nl_sock’ внутри списка параметров /home/test/accel-ppp/accel-pppd/extra/shaper_tbf.c: В функции ‘install_ingress’: /home/test/accel-ppp/accel-pppd/extra/shaper_tbf.c:233: предупреждение: в передаче аргумента 1 ‘nl_send_auto_complete’: несовместимый тип указателя /usr/include/netlink/netlink.h:48: замечание: expected ‘struct nl_handle *’ but argum ent is of type ‘struct nl_sock *’ /home/test/accel-ppp/accel-pppd/extra/shaper_tbf.c:236: предупреждение: в передаче аргумента 1 ‘nl_wait_for_ack’: несовместимый тип указателя /usr/include/netlink/netlink.h:63: замечание: expected ‘struct nl_handle *’ but argum ent is of type ‘struct nl_sock *’ /home/test/accel-ppp/accel-pppd/extra/shaper_tbf.c: На верхнем уровне: /home/test/accel-ppp/accel-pppd/extra/shaper_tbf.c:254: предупреждение: декларация ‘struct nl_sock’ внутри списка параметров /home/test/accel-ppp/accel-pppd/extra/shaper_tbf.c: В функции ‘install_filter’: /home/test/accel-ppp/accel-pppd/extra/shaper_tbf.c:339: предупреждение: в передаче аргумента 1 ‘nl_send_auto_complete’: несовместимый тип указателя /usr/include/netlink/netlink.h:48: замечание: expected ‘struct nl_handle *’ but argum ent is of type ‘struct nl_sock *’ /home/test/accel-ppp/accel-pppd/extra/shaper_tbf.c:342: предупреждение: в передаче аргумента 1 ‘nl_wait_for_ack’: несовместимый тип указателя /usr/include/netlink/netlink.h:63: замечание: expected ‘struct nl_handle *’ but argum ent is of type ‘struct nl_sock *’ /home/test/accel-ppp/accel-pppd/extra/shaper_tbf.c: В функции ‘install_shaper’: /home/test/accel-ppp/accel-pppd/extra/shaper_tbf.c:391: предупреждение: неявная дек ларация функции ‘nl_socket_alloc’ /home/test/accel-ppp/accel-pppd/extra/shaper_tbf.c:391: предупреждение: в присваива нии целое преобразуется в указатель без приведения типа /home/test/accel-ppp/accel-pppd/extra/shaper_tbf.c:397: предупреждение: в передаче аргумента 1 ‘nl_connect’: несовместимый тип указателя /usr/include/netlink/netlink.h:40: замечание: expected ‘struct nl_handle *’ but argum ent is of type ‘struct nl_sock *’ /home/test/accel-ppp/accel-pppd/extra/shaper_tbf.c:404: предупреждение: в передаче аргумента 1 ‘install_tbf’: несовместимый тип указателя /home/test/accel-ppp/accel-pppd/extra/shaper_tbf.c:146: замечание: expected ‘struct nl_sock *’ but argument is of type ‘struct nl_sock *’ /home/test/accel-ppp/accel-pppd/extra/shaper_tbf.c:408: предупреждение: в передаче аргумента 1 ‘install_ingress’: несовместимый тип указателя /home/test/accel-ppp/accel-pppd/extra/shaper_tbf.c:213: замечание: expected ‘struct nl_sock *’ but argument is of type ‘struct nl_sock *’ /home/test/accel-ppp/accel-pppd/extra/shaper_tbf.c:410: предупреждение: в передаче аргумента 1 ‘install_filter’: несовместимый тип указателя /home/test/accel-ppp/accel-pppd/extra/shaper_tbf.c:254: замечание: expected ‘struct nl_sock *’ but argument is of type ‘struct nl_sock *’ /home/test/accel-ppp/accel-pppd/extra/shaper_tbf.c:414: предупреждение: в передаче аргумента 1 ‘nl_close’: несовместимый тип указателя /usr/include/netlink/netlink.h:41: замечание: expected ‘struct nl_handle *’ but argum ent is of type ‘struct nl_sock *’ /home/test/accel-ppp/accel-pppd/extra/shaper_tbf.c:416: предупреждение: неявная дек ларация функции ‘nl_socket_free’ /home/test/accel-ppp/accel-pppd/extra/shaper_tbf.c: В функции ‘remove_shaper’: /home/test/accel-ppp/accel-pppd/extra/shaper_tbf.c:484: предупреждение: в присваива нии целое преобразуется в указатель без приведения типа /home/test/accel-ppp/accel-pppd/extra/shaper_tbf.c:490: предупреждение: в передаче аргумента 1 ‘nl_connect’: несовместимый тип указателя /usr/include/netlink/netlink.h:40: замечание: expected ‘struct nl_handle *’ but argum ent is of type ‘struct nl_sock *’ /home/test/accel-ppp/accel-pppd/extra/shaper_tbf.c:504: предупреждение: в передаче аргумента 1 ‘nl_send_auto_complete’: несовместимый тип указателя /usr/include/netlink/netlink.h:48: замечание: expected ‘struct nl_handle *’ but argum ent is of type ‘struct nl_sock *’ /home/test/accel-ppp/accel-pppd/extra/shaper_tbf.c:507: предупреждение: в передаче аргумента 1 ‘nl_wait_for_ack’: несовместимый тип указателя /usr/include/netlink/netlink.h:63: замечание: expected ‘struct nl_handle *’ but argum ent is of type ‘struct nl_sock *’ /home/test/accel-ppp/accel-pppd/extra/shaper_tbf.c:519: предупреждение: в передаче аргумента 1 ‘nl_send_auto_complete’: несовместимый тип указателя /usr/include/netlink/netlink.h:48: замечание: expected ‘struct nl_handle *’ but argum ent is of type ‘struct nl_sock *’ /home/test/accel-ppp/accel-pppd/extra/shaper_tbf.c:522: предупреждение: в передаче аргумента 1 ‘nl_wait_for_ack’: несовместимый тип указателя /usr/include/netlink/netlink.h:63: замечание: expected ‘struct nl_handle *’ but argum ent is of type ‘struct nl_sock *’ /home/test/accel-ppp/accel-pppd/extra/shaper_tbf.c:527: предупреждение: в передаче аргумента 1 ‘nl_close’: несовместимый тип указателя /usr/include/netlink/netlink.h:41: замечание: expected ‘struct nl_handle *’ but argum ent is of type ‘struct nl_sock *’ /home/test/accel-ppp/accel-pppd/extra/shaper_tbf.c:537: предупреждение: в передаче аргумента 1 ‘nl_close’: несовместимый тип указателя /usr/include/netlink/netlink.h:41: замечание: expected ‘struct nl_handle *’ but argum ent is of type ‘struct nl_sock *’ Linking C shared library libshaper_tbf.so [ 96%] Built target shaper_tbf Scanning dependencies of target sigchld [ 98%] Building C object accel-pppd/extra/CMakeFiles/sigchld.dir/sigchld.c.o Linking C shared library libsigchld.so [ 98%] Built target sigchld Scanning dependencies of target pptp_drv [ 98%] Generating driver/pptp.ko [100%] Built target pptp_drv
  5. accel pptpd

    Всем привет! Помогите собрать Ассел-ппп с шейпером, так как без него собираеться, а с ним вот такая ошибка Linux mandriva 2.6.35.9-new #1 SMP Tue Mar 29 01:08:05 EEST 2011 i686 i686 i386 GNU AMD AthlonX2 DualCore QL-60 /home/test/accel-ppp/accel-pppd/extra/shaper_tbf.c:13:29: error: netlink/netlink.h: Нет такого файла или каталога /home/test/accel-ppp/accel-pppd/extra/shaper_tbf.c:14:28: error: netlink/socket.h: Нет такого файла или каталога /home/test/accel-ppp/accel-pppd/extra/shaper_tbf.c:15:25: error: netlink/msg.h: Нет такого файла или каталога /home/test/accel-ppp/accel-pppd/extra/shaper_tbf.c:146: предупреждение: декларация ‘struct nl_sock’ внутри списка параметров /home/test/accel-ppp/accel-pppd/extra/shaper_tbf.c:146: предупреждение: область действия типа - только данная декларация или определение, что может не соответствовать вашим намерениям /home/test/accel-ppp/accel-pppd/extra/shaper_tbf.c: В функции ‘install_tbf’: /home/test/accel-ppp/accel-pppd/extra/shaper_tbf.c:155: ошибка: переменная ‘tchdr’ инициализирована, хотя имеет неполный тип /home/test/accel-ppp/accel-pppd/extra/shaper_tbf.c:156: ошибка: неизвестное поле ‘tcm_family’ в инициализаторе /home/test/accel-ppp/accel-pppd/extra/shaper_tbf.c:156: предупреждение: избыточные элементы в инициализаторе структуры /home/test/accel-ppp/accel-pppd/extra/shaper_tbf.c:156: предупреждение: (где-то рядом с инициализацией для ‘tchdr’) /home/test/accel-ppp/accel-pppd/extra/shaper_tbf.c:157: ошибка: неизвестное поле ‘tcm_ifindex’ в инициализаторе /home/test/accel-ppp/accel-pppd/extra/shaper_tbf.c:157: предупреждение: избыточные элементы в инициализаторе структуры /home/test/accel-ppp/accel-pppd/extra/shaper_tbf.c:157: предупреждение: (где-то рядом с инициализацией для ‘tchdr’) /home/test/accel-ppp/accel-pppd/extra/shaper_tbf.c:158: ошибка: неизвестное поле ‘tcm_handle’ в инициализаторе /home/test/accel-ppp/accel-pppd/extra/shaper_tbf.c:158: предупреждение: избыточные элементы в инициализаторе структуры /home/test/accel-ppp/accel-pppd/extra/shaper_tbf.c:158: предупреждение: (где-то рядом с инициализацией для ‘tchdr’) /home/test/accel-ppp/accel-pppd/extra/shaper_tbf.c:159: ошибка: неизвестное поле ‘tcm_parent’ в инициализаторе /home/test/accel-ppp/accel-pppd/extra/shaper_tbf.c:159: предупреждение: избыточные элементы в инициализаторе структуры /home/test/accel-ppp/accel-pppd/extra/shaper_tbf.c:159: предупреждение: (где-то рядом с инициализацией для ‘tchdr’) /home/test/accel-ppp/accel-pppd/extra/shaper_tbf.c:155: ошибка: размер ‘tchdr’ в памяти неизвестен /home/test/accel-ppp/accel-pppd/extra/shaper_tbf.c:171: предупреждение: неявная декларация функции ‘nlmsg_alloc’ /home/test/accel-ppp/accel-pppd/extra/shaper_tbf.c:171: предупреждение: в присваивании целое преобразуется в указатель без приведения типа /home/test/accel-ppp/accel-pppd/extra/shaper_tbf.c:175: предупреждение: неявная декларация функции ‘NLA_PUT’ /home/test/accel-ppp/accel-pppd/extra/shaper_tbf.c:178: предупреждение: неявная декларация функции ‘nlmsg_alloc_simple’ /home/test/accel-ppp/accel-pppd/extra/shaper_tbf.c:178: ошибка: ‘RTM_NEWQDISC’ не описан (первое использование в этой функции) /home/test/accel-ppp/accel-pppd/extra/shaper_tbf.c:178: ошибка: (Сообщение о неописанном идентификаторе выдается один раз /home/test/accel-ppp/accel-pppd/extra/shaper_tbf.c:178: ошибка: для каждой функции, в которой он используется.) /home/test/accel-ppp/accel-pppd/extra/shaper_tbf.c:178: ошибка: ‘NLM_F_CREATE’ не описан (первое использование в этой функции) /home/test/accel-ppp/accel-pppd/extra/shaper_tbf.c:178: ошибка: ‘NLM_F_REPLACE’ не описан (первое использование в этой функции) /home/test/accel-ppp/accel-pppd/extra/shaper_tbf.c:182: предупреждение: неявная декларация функции ‘nlmsg_append’ /home/test/accel-ppp/accel-pppd/extra/shaper_tbf.c:182: ошибка: ‘NLMSG_ALIGNTO’ не описан (первое использование в этой функции) /home/test/accel-ppp/accel-pppd/extra/shaper_tbf.c:185: предупреждение: неявная декларация функции ‘NLA_PUT_STRING’ /home/test/accel-ppp/accel-pppd/extra/shaper_tbf.c:185: ошибка: ‘TCA_KIND’ не описан (первое использование в этой функции) /home/test/accel-ppp/accel-pppd/extra/shaper_tbf.c:186: предупреждение: неявная декларация функции ‘nla_put_nested’ /home/test/accel-ppp/accel-pppd/extra/shaper_tbf.c:186: ошибка: ‘TCA_OPTIONS’ не описан (первое использование в этой функции) /home/test/accel-ppp/accel-pppd/extra/shaper_tbf.c:188: предупреждение: неявная декларация функции ‘nl_send_auto_complete’ /home/test/accel-ppp/accel-pppd/extra/shaper_tbf.c:191: предупреждение: неявная декларация функции ‘nl_wait_for_ack’ /home/test/accel-ppp/accel-pppd/extra/shaper_tbf.c:194: предупреждение: неявная декларация функции ‘nlmsg_free’ /home/test/accel-ppp/accel-pppd/extra/shaper_tbf.c:200: предупреждение: метка ‘nla_put_failure’ определена, но не используется /home/test/accel-ppp/accel-pppd/extra/shaper_tbf.c:155: предупреждение: неиспользуемая переменная ‘tchdr’ /home/test/accel-ppp/accel-pppd/extra/shaper_tbf.c: На верхнем уровне: /home/test/accel-ppp/accel-pppd/extra/shaper_tbf.c:213: предупреждение: декларация ‘struct nl_sock’ внутри списка параметров /home/test/accel-ppp/accel-pppd/extra/shaper_tbf.c: В функции ‘install_ingress’: /home/test/accel-ppp/accel-pppd/extra/shaper_tbf.c:217: ошибка: переменная ‘tchdr’ инициализирована, хотя имеет неполный тип /home/test/accel-ppp/accel-pppd/extra/shaper_tbf.c:218: ошибка: неизвестное поле ‘tcm_family’ в инициализаторе /home/test/accel-ppp/accel-pppd/extra/shaper_tbf.c:218: предупреждение: избыточные элементы в инициализаторе структуры /home/test/accel-ppp/accel-pppd/extra/shaper_tbf.c:218: предупреждение: (где-то рядом с инициализацией для ‘tchdr’) /home/test/accel-ppp/accel-pppd/extra/shaper_tbf.c:219: ошибка: неизвестное поле ‘tcm_ifindex’ в инициализаторе /home/test/accel-ppp/accel-pppd/extra/shaper_tbf.c:219: предупреждение: избыточные элементы в инициализаторе структуры /home/test/accel-ppp/accel-pppd/extra/shaper_tbf.c:219: предупреждение: (где-то рядом с инициализацией для ‘tchdr’) /home/test/accel-ppp/accel-pppd/extra/shaper_tbf.c:220: ошибка: неизвестное поле ‘tcm_handle’ в инициализаторе /home/test/accel-ppp/accel-pppd/extra/shaper_tbf.c:220: предупреждение: избыточные элементы в инициализаторе структуры /home/test/accel-ppp/accel-pppd/extra/shaper_tbf.c:220: предупреждение: (где-то рядом с инициализацией для ‘tchdr’) /home/test/accel-ppp/accel-pppd/extra/shaper_tbf.c:221: ошибка: неизвестное поле ‘tcm_parent’ в инициализаторе /home/test/accel-ppp/accel-pppd/extra/shaper_tbf.c:221: предупреждение: избыточные элементы в инициализаторе структуры /home/test/accel-ppp/accel-pppd/extra/shaper_tbf.c:221: предупреждение: (где-то рядом с инициализацией для ‘tchdr’) /home/test/accel-ppp/accel-pppd/extra/shaper_tbf.c:217: ошибка: размер ‘tchdr’ в памяти неизвестен /home/test/accel-ppp/accel-pppd/extra/shaper_tbf.c:224: ошибка: ‘RTM_NEWQDISC’ не описан (первое использование в этой функции) /home/test/accel-ppp/accel-pppd/extra/shaper_tbf.c:224: ошибка: ‘NLM_F_CREATE’ не описан (первое использование в этой функции) /home/test/accel-ppp/accel-pppd/extra/shaper_tbf.c:224: ошибка: ‘NLM_F_REPLACE’ не описан (первое использование в этой функции) /home/test/accel-ppp/accel-pppd/extra/shaper_tbf.c:228: ошибка: ‘NLMSG_ALIGNTO’ не описан (первое использование в этой функции) /home/test/accel-ppp/accel-pppd/extra/shaper_tbf.c:231: ошибка: ‘TCA_KIND’ не описан (первое использование в этой функции) /home/test/accel-ppp/accel-pppd/extra/shaper_tbf.c:244: предупреждение: метка ‘nla_put_failure’ определена, но не используется /home/test/accel-ppp/accel-pppd/extra/shaper_tbf.c:217: предупреждение: неиспользуемая переменная ‘tchdr’ /home/test/accel-ppp/accel-pppd/extra/shaper_tbf.c: На верхнем уровне: /home/test/accel-ppp/accel-pppd/extra/shaper_tbf.c:254: предупреждение: декларация ‘struct nl_sock’ внутри списка параметров /home/test/accel-ppp/accel-pppd/extra/shaper_tbf.c: В функции ‘install_filter’: /home/test/accel-ppp/accel-pppd/extra/shaper_tbf.c:267: ошибка: переменная ‘tchdr’ инициализирована, хотя имеет неполный тип /home/test/accel-ppp/accel-pppd/extra/shaper_tbf.c:268: ошибка: неизвестное поле ‘tcm_family’ в инициализаторе /home/test/accel-ppp/accel-pppd/extra/shaper_tbf.c:268: предупреждение: избыточные элементы в инициализаторе структуры /home/test/accel-ppp/accel-pppd/extra/shaper_tbf.c:268: предупреждение: (где-то рядом с инициализацией для ‘tchdr’) /home/test/accel-ppp/accel-pppd/extra/shaper_tbf.c:269: ошибка: неизвестное поле ‘tcm_ifindex’ в инициализаторе /home/test/accel-ppp/accel-pppd/extra/shaper_tbf.c:269: предупреждение: избыточные элементы в инициализаторе структуры /home/test/accel-ppp/accel-pppd/extra/shaper_tbf.c:269: предупреждение: (где-то рядом с инициализацией для ‘tchdr’) /home/test/accel-ppp/accel-pppd/extra/shaper_tbf.c:270: ошибка: неизвестное поле ‘tcm_handle’ в инициализаторе /home/test/accel-ppp/accel-pppd/extra/shaper_tbf.c:270: предупреждение: избыточные элементы в инициализаторе структуры /home/test/accel-ppp/accel-pppd/extra/shaper_tbf.c:270: предупреждение: (где-то рядом с инициализацией для ‘tchdr’) /home/test/accel-ppp/accel-pppd/extra/shaper_tbf.c:271: ошибка: неизвестное поле ‘tcm_parent’ в инициализаторе /home/test/accel-ppp/accel-pppd/extra/shaper_tbf.c:271: предупреждение: избыточные элементы в инициализаторе структуры /home/test/accel-ppp/accel-pppd/extra/shaper_tbf.c:271: предупреждение: (где-то рядом с инициализацией для ‘tchdr’) /home/test/accel-ppp/accel-pppd/extra/shaper_tbf.c:272: ошибка: неизвестное поле ‘tcm_info’ в инициализаторе /home/test/accel-ppp/accel-pppd/extra/shaper_tbf.c:272: предупреждение: избыточные элементы в инициализаторе структуры /home/test/accel-ppp/accel-pppd/extra/shaper_tbf.c:272: предупреждение: (где-то рядом с инициализацией для ‘tchdr’) /home/test/accel-ppp/accel-pppd/extra/shaper_tbf.c:267: ошибка: размер ‘tchdr’ в памяти неизвестен /home/test/accel-ppp/accel-pppd/extra/shaper_tbf.c:294: ошибка: ‘RTM_NEWTFILTER’ не описан (первое использование в этой функции) /home/test/accel-ppp/accel-pppd/extra/shaper_tbf.c:294: ошибка: ‘NLM_F_CREATE’ не описан (первое использование в этой функции) /home/test/accel-ppp/accel-pppd/extra/shaper_tbf.c:294: ошибка: ‘NLM_F_REPLACE’ не описан (первое использование в этой функции) /home/test/accel-ppp/accel-pppd/extra/shaper_tbf.c:298: предупреждение: в присваивании целое преобразуется в указатель без приведения типа /home/test/accel-ppp/accel-pppd/extra/shaper_tbf.c:302: предупреждение: в присваивании целое преобразуется в указатель без приведения типа /home/test/accel-ppp/accel-pppd/extra/shaper_tbf.c:306: предупреждение: в присваивании целое преобразуется в указатель без приведения типа /home/test/accel-ppp/accel-pppd/extra/shaper_tbf.c:310: предупреждение: в присваивании целое преобразуется в указатель без приведения типа /home/test/accel-ppp/accel-pppd/extra/shaper_tbf.c:314: ошибка: ‘NLMSG_ALIGNTO’ не описан (первое использование в этой функции) /home/test/accel-ppp/accel-pppd/extra/shaper_tbf.c:317: ошибка: ‘TCA_KIND’ не описан (первое использование в этой функции) /home/test/accel-ppp/accel-pppd/extra/shaper_tbf.c:319: предупреждение: неявная декларация функции ‘NLA_PUT_U32’ /home/test/accel-ppp/accel-pppd/extra/shaper_tbf.c:336: ошибка: ‘TCA_OPTIONS’ не описан (первое использование в этой функции) /home/test/accel-ppp/accel-pppd/extra/shaper_tbf.c:354: предупреждение: метка ‘nla_put_failure’ определена, но не используется /home/test/accel-ppp/accel-pppd/extra/shaper_tbf.c:267: предупреждение: неиспользуемая переменная ‘tchdr’ /home/test/accel-ppp/accel-pppd/extra/shaper_tbf.c: В функции ‘install_shaper’: /home/test/accel-ppp/accel-pppd/extra/shaper_tbf.c:391: предупреждение: неявная декларация функции ‘nl_socket_alloc’ /home/test/accel-ppp/accel-pppd/extra/shaper_tbf.c:391: предупреждение: в присваивании целое преобразуется в указатель без приведения типа /home/test/accel-ppp/accel-pppd/extra/shaper_tbf.c:397: предупреждение: неявная декларация функции ‘nl_connect’ /home/test/accel-ppp/accel-pppd/extra/shaper_tbf.c:397: ошибка: ‘NETLINK_ROUTE’ не описан (первое использование в этой функции) /home/test/accel-ppp/accel-pppd/extra/shaper_tbf.c:404: предупреждение: в передаче аргумента 1 ‘install_tbf’: несовместимый тип указателя /home/test/accel-ppp/accel-pppd/extra/shaper_tbf.c:146: замечание: expected ‘struct nl_sock *’ but argument is of type ‘struct nl_sock *’ /home/test/accel-ppp/accel-pppd/extra/shaper_tbf.c:408: предупреждение: в передаче аргумента 1 ‘install_ingress’: несовместимый тип указателя /home/test/accel-ppp/accel-pppd/extra/shaper_tbf.c:213: замечание: expected ‘struct nl_sock *’ but argument is of type ‘struct nl_sock *’ /home/test/accel-ppp/accel-pppd/extra/shaper_tbf.c:410: предупреждение: в передаче аргумента 1 ‘install_filter’: несовместимый тип указателя /home/test/accel-ppp/accel-pppd/extra/shaper_tbf.c:254: замечание: expected ‘struct nl_sock *’ but argument is of type ‘struct nl_sock *’ /home/test/accel-ppp/accel-pppd/extra/shaper_tbf.c:414: предупреждение: неявная декларация функции ‘nl_close’ /home/test/accel-ppp/accel-pppd/extra/shaper_tbf.c:416: предупреждение: неявная декларация функции ‘nl_socket_free’ /home/test/accel-ppp/accel-pppd/extra/shaper_tbf.c: В функции ‘remove_shaper’: /home/test/accel-ppp/accel-pppd/extra/shaper_tbf.c:470: ошибка: переменная ‘tchdr1’ инициализирована, хотя имеет неполный тип /home/test/accel-ppp/accel-pppd/extra/shaper_tbf.c:471: ошибка: неизвестное поле ‘tcm_family’ в инициализаторе /home/test/accel-ppp/accel-pppd/extra/shaper_tbf.c:471: предупреждение: избыточные элементы в инициализаторе структуры /home/test/accel-ppp/accel-pppd/extra/shaper_tbf.c:471: предупреждение: (где-то рядом с инициализацией для ‘tchdr1’) /home/test/accel-ppp/accel-pppd/extra/shaper_tbf.c:472: ошибка: неизвестное поле ‘tcm_ifindex’ в инициализаторе /home/test/accel-ppp/accel-pppd/extra/shaper_tbf.c:472: предупреждение: избыточные элементы в инициализаторе структуры /home/test/accel-ppp/accel-pppd/extra/shaper_tbf.c:472: предупреждение: (где-то рядом с инициализацией для ‘tchdr1’) /home/test/accel-ppp/accel-pppd/extra/shaper_tbf.c:473: ошибка: неизвестное поле ‘tcm_handle’ в инициализаторе /home/test/accel-ppp/accel-pppd/extra/shaper_tbf.c:473: предупреждение: избыточные элементы в инициализаторе структуры /home/test/accel-ppp/accel-pppd/extra/shaper_tbf.c:473: предупреждение: (где-то рядом с инициализацией для ‘tchdr1’) /home/test/accel-ppp/accel-pppd/extra/shaper_tbf.c:474: ошибка: неизвестное поле ‘tcm_parent’ в инициализаторе /home/test/accel-ppp/accel-pppd/extra/shaper_tbf.c:474: предупреждение: избыточные элементы в инициализаторе структуры /home/test/accel-ppp/accel-pppd/extra/shaper_tbf.c:474: предупреждение: (где-то рядом с инициализацией для ‘tchdr1’) /home/test/accel-ppp/accel-pppd/extra/shaper_tbf.c:470: ошибка: размер ‘tchdr1’ в памяти неизвестен /home/test/accel-ppp/accel-pppd/extra/shaper_tbf.c:477: ошибка: переменная ‘tchdr2’ инициализирована, хотя имеет неполный тип /home/test/accel-ppp/accel-pppd/extra/shaper_tbf.c:478: ошибка: неизвестное поле ‘tcm_family’ в инициализаторе /home/test/accel-ppp/accel-pppd/extra/shaper_tbf.c:478: предупреждение: избыточные элементы в инициализаторе структуры /home/test/accel-ppp/accel-pppd/extra/shaper_tbf.c:478: предупреждение: (где-то рядом с инициализацией для ‘tchdr2’) /home/test/accel-ppp/accel-pppd/extra/shaper_tbf.c:479: ошибка: неизвестное поле ‘tcm_ifindex’ в инициализаторе /home/test/accel-ppp/accel-pppd/extra/shaper_tbf.c:479: предупреждение: избыточные элементы в инициализаторе структуры /home/test/accel-ppp/accel-pppd/extra/shaper_tbf.c:479: предупреждение: (где-то рядом с инициализацией для ‘tchdr2’) /home/test/accel-ppp/accel-pppd/extra/shaper_tbf.c:480: ошибка: неизвестное поле ‘tcm_handle’ в инициализаторе /home/test/accel-ppp/accel-pppd/extra/shaper_tbf.c:480: предупреждение: избыточные элементы в инициализаторе структуры /home/test/accel-ppp/accel-pppd/extra/shaper_tbf.c:480: предупреждение: (где-то рядом с инициализацией для ‘tchdr2’) /home/test/accel-ppp/accel-pppd/extra/shaper_tbf.c:481: ошибка: неизвестное поле ‘tcm_parent’ в инициализаторе /home/test/accel-ppp/accel-pppd/extra/shaper_tbf.c:481: предупреждение: избыточные элементы в инициализаторе структуры /home/test/accel-ppp/accel-pppd/extra/shaper_tbf.c:481: предупреждение: (где-то рядом с инициализацией для ‘tchdr2’) /home/test/accel-ppp/accel-pppd/extra/shaper_tbf.c:477: ошибка: размер ‘tchdr2’ в памяти неизвестен /home/test/accel-ppp/accel-pppd/extra/shaper_tbf.c:484: предупреждение: в присваивании целое преобразуется в указатель без приведения типа /home/test/accel-ppp/accel-pppd/extra/shaper_tbf.c:490: ошибка: ‘NETLINK_ROUTE’ не описан (первое использование в этой функции) /home/test/accel-ppp/accel-pppd/extra/shaper_tbf.c:497: ошибка: ‘RTM_DELQDISC’ не описан (первое использование в этой функции) /home/test/accel-ppp/accel-pppd/extra/shaper_tbf.c:497: ошибка: ‘NLM_F_CREATE’ не описан (первое использование в этой функции) /home/test/accel-ppp/accel-pppd/extra/shaper_tbf.c:497: ошибка: ‘NLM_F_REPLACE’ не описан (первое использование в этой функции) /home/test/accel-ppp/accel-pppd/extra/shaper_tbf.c:501: ошибка: ‘NLMSG_ALIGNTO’ не описан (первое использование в этой функции) /home/test/accel-ppp/accel-pppd/extra/shaper_tbf.c:477: предупреждение: неиспользуемая переменная ‘tchdr2’ /home/test/accel-ppp/accel-pppd/extra/shaper_tbf.c:470: предупреждение: неиспользуемая переменная ‘tchdr1’ make[2]: *** [accel-pppd/extra/CMakeFiles/shaper_tbf.dir/shaper_tbf.c.o] Ошибка 1 make[1]: *** [accel-pppd/extra/CMakeFiles/shaper_tbf.dir/all] Ошибка 2 make: *** [all] Ошибка 2
  6. accel pptpd

    ==> Недостающие зависимости: -> ppp,accel-pptp-kernel-git ==> Проверяю необходимые для сборки зависимости... ==> ОШИБКА: Не удалось разрешить все зависимости. сдесь их найти не выходит https://aur.archlinux.org/packages.php?ID=32257
  7. accel pptpd

    Спасибо, для Madriva помогло, а для Arch я как раз и делал make oldconfig && make prepare перед этой ошибкой [ 98%] Generating driver/pptp.ko WARNING: Symbol version dump /usr/src/linux-2.6.33/Module.symvers is missing; modules will have no dependencies and modversions. make[4]: scripts/mod/modpost: Command not found make[4]: *** [__modpost] Error 127 make[3]: *** [modules] Error 2 make[2]: *** [driver/driver/pptp.ko] Error 2 make[1]: *** [driver/CMakeFiles/pptp_drv.dir/all] Error 2 make: *** [all] Error 2 попробую поставить и здесь ядро поновее
  8. accel pptpd

    Помогите с установкой accel-ppp-1.3.5 Перед установкой на рабочей машине пробую поставить на виртуальной mandrivafree 2.6.37.2 i386 AMD AthlonX2 DualCore .... Linking C executable accel-pppd CMakeFiles/accel-pppd.dir/log.c.o: In function `do_log': log.c:(.text+0x5ad): undefined reference to `__sync_sub_and_fetch_4' CMakeFiles/accel-pppd.dir/log.c.o: In function `log_free_msg': log.c:(.text+0xbc4): undefined reference to `__sync_sub_and_fetch_4' triton/libtriton.so: undefined reference to `__sync_fetch_and_add_4' collect2: выполнение ld завершилось с кодом возврата 1 make[2]: *** [accel-pppd/accel-pppd] Ошибка 1 make[1]: *** [accel-pppd/CMakeFiles/accel-pppd.dir/all] Ошибка 2 make: *** [all] Ошибка 2 так же не выходит поставить accel-ppp-1.3.5 и на виртуальной 2.6.33-ARCH #1 SMP PREEMPT Thu May 13 11:32:37 CEST 2010 x86_64 AMD AthlonX2 DualCore QL-60 AuthenticAMD GNU/Linux [ 98%] Generating driver/pptp.ko WARNING: Symbol version dump /usr/src/linux-2.6.33/Module.symvers is missing; modules will have no dependencies and modversions. make[4]: scripts/mod/modpost: Command not found make[4]: *** [__modpost] Error 127 make[3]: *** [modules] Error 2 make[2]: *** [driver/driver/pptp.ko] Error 2 make[1]: *** [driver/CMakeFiles/pptp_drv.dir/all] Error 2 make: *** [all] Error 2 Хоть бери и без драйвера ставь
  9. Рады сообщить всем что 21.03.2011 в свет вышел новый релиз АСР Abills 0.52 Главными изменениями стали: • Добавлены платёжные системы Ibox, OSMP, QIWI, Liqpay, flashcheque • Добавлен модуль Maps - Карта сети • Добавлен модуль для отображения графиков использования трафика и поточной скорости для клиентов, тарифных планов, серверов доступа • Добавлена возможность создавать сети и подсети для DHCP • Улучшена работа с сообщениями для администраторов o Добавлено создание внутренних сообщений в ответах администраторов для внутренних комментариев o Добавлена рассылка сообщений всем администраторам подписанным на тему, при создании и темы и при работе с ней • Установка скорости на пул адресов • Добавлена поддержка pppd coa и НАС accel-pptpd • Добавлена поддержка коммутаторов CeLan • Администраторам добавлено отдельные права на изменение тарифных планов, кредита, возможность скрывать удалённых пользователей, только администратор со спец правами может их удалять полностью • Обновлен шейпер для Freebsd • В DHCPhost добавлено поле гостевой VLAN и возможность не блокировать должников на порту, а перебрасывать в гостевой VLAN • Snmputils добавлен кабельный тестер, перевод должников в гостевой VLAN • Возможность массовой выписки счетов из WEB интерфейса • Возможность менять тариф из пользовательского кабинета только раз в месяц независимо от тарифа • Новая система ведения бонусов Полный лог изменений здесь
  10. И мне пожалуйста продублируйте предложение для Украины moose (a) email.ua
  11. А такое в ядре присутсвует? device apic options SMP Должно само опредилять Для НТ прописать в /boot/loader.conf machdep.hyperthreading_allowed=1
  12. Текст официального анонса Рады сообщить всем что 31.05.2010 в свет вышел новый релиз АСР Abills 0.51. Так как система пользуется большим спросом, и ее использует многие Интернет провайдеры, мы все время работаем над внесением новых идей и добавлением новых возможностей. В связи с тем что после анонсирования Abills 0.50 произошло огромное количество новшеств, но не столь много времени, мы все-таки решили выдать новый релиз. Главными изменениями стали • добавление платёжных систем 4PAY, EasySoft, АИС ЕРИП (Беларусия), Liberty • Обновлён модуль Ashield (Dr.Web AV Desk) • возможность перевода средств между акаунтами абонентов • Добавлена возможность пересчёта сессий в форме детализации сессии • Добавлена программа выявления несанкционированных PPPoE серверов. • Добавлен журнал адресов • Добавлен новый тип внесения средств на счёт «Компенсация» • В фетчер сетей добавлена возможность поднимать статические рауты на нужные интерфейсы. • Добавлена проверка на дублирование коммутатора и порта для Option 82. • Добавлена возможность писать скрипты для программы billd (/libexec/billd) • Добавлена возможность создавать независимые шаблоны бухгалтерских документов для групп пользователей. • Добавлена дата окончания скидки для клиента • Добавлено уведомления о том что пользователь онлайн в личном кабинете пользователя С полным списком внедрений и улучшений можно ознакомиться на оф.сайте Abills http://abills.net.ua/wiki/doku.php/abills:...0.5x#section051